{"text_format":"1","workbook":"xlsx","n_sheets":9,"sheets":["基礎データ","補助金交付申請書","小地域福祉ネットワークづくり","ふれあい給食サービス","おたがいさま見守り事業","ふれあい・いきいきサロン（新規）","ふれあい・いきいきサロン（継続）","予算書 ①","予算書②"],"not_rendered":{"charts":0,"images":0,"macros":0,"external_links":0,"defined_names":7,"comments":2,"pivot_tables":0},"unopened":[],"bounds":{"document_bytes":16777216,"sheet_cells":100000,"rows_first":2000,"rows_last":500,"rows_between":2000,"halvings":0,"cell_chars":16384,"cell_head_chars":4096},"cells_cut":0,"cells_raw":0,"read":"whole","date_system":"1900"}

{"sheet":"基礎データ","index":0,"n_rows":8,"n_cols":10,"rows_kept":8,"cut":false,"hidden":false,"merged":[[4,9,4,11],[6,9,6,11],[7,9,7,11],[1,7,1,8],[1,1,2,6],[1,9,2,11],[3,9,3,11],[5,9,5,11]]}
[]
[null,"事　業　名",null,null,null,null,null,"添付書類",null,"予算書"]
[null,null,null,null,null,null,null,"（１）","（２）"]
[null,"小地域福祉ネットワークづくり事業",null,null,null,null,null,"事業計画書","収支予算書","予算書①"]
[null,"おたがいさま見守り事業（ふれあい給食サービス事業）",null,null,null,null,null,"事業計画書","収支予算書","予算書①"]
[null,"おたがいさま見守り事業（会食・交流事業）",null,null,null,null,null,"事業計画書","収支予算書","予算書②"]
[null,"ふれあい・いきいきサロン新規事業",null,null,null,null,null,"事業計画書"]
[null,"ふれあい・いきいきサロン継続事業",null,null,null,null,null,"ふれあい・いきいきサロン\n継続実施状況等確認票"]

{"sheet":"補助金交付申請書","index":1,"n_rows":29,"n_cols":14,"rows_kept":29,"cut":false,"hidden":false,"merged":[[19,0,20,13],[22,5,22,6],[9,6,9,7],[11,7,11,11],[14,1,14,2],[14,3,14,7],[14,8,14,13],[16,0,16,13],[17,0,17,13]]}
["（様式第１号）"]
[null,null,null,null,null,null,null,"令和","元","年",null,"月",null,"日"]
[]
[]
[]
["倉吉市社会福祉協議会長"]
[null,"会長　坂　本　　操　様"]
[]
[]
[null,null,null,null,null,null,null,null,"地区社会福祉協議会"]
[]
[null,null,null,null,null,null,"会長",null,null,null,null,null,"印"]
[]
[]
[null,{"$f":"H2&I2&\"年度\"","v":"令和元年度"},null,"ふれあい・いきいきサロン継続事業",null,null,null,null,"補助金の交付について（申請）"]
[]
[{"$f":"B15&\"において標記の補助金を下記のとおり受けたいので、倉吉市社会福祉\"","v":"令和元年度において標記の補助金を下記のとおり受けたいので、倉吉市社会福祉"}]
["協議会補助金等交付規程第４条の規定により関係書類を添えて申請します。"]
[]
["記"]
[]
[]
[1,"：","補助金交付申請額",null,null,null,null,"円"]
[]
[2,"：","添付書類"]
[]
[null,null,{"$f":"IF(D27=\"\",\"\",\"（１）\")","v":"（１）"},{"$f":"IF(VLOOKUP(D15,基礎データ!$B$4:$I$8,7,FALSE)=0,\"\",VLOOKUP(D15,基礎データ!$B$4:$I$8,7,FALSE))","v":"ふれあい・いきいきサロン\n継続実施状況等確認票"}]
[]
[null,null,{"$f":"IF(D29=\"\",\"\",\"（２）\")","v":""},{"$f":"IF(VLOOKUP(D15,基礎データ!$B$4:$I$8,8,FALSE)=0,\"\",VLOOKUP(D15,基礎データ!$B$4:$I$8,8,FALSE))","v":""}]

{"sheet":"小地域福祉ネットワークづくり","index":2,"n_rows":37,"n_cols":7,"rows_kept":37,"cut":false,"hidden":false,"merged":[[2,0,2,6],[18,5,19,5],[18,6,19,6],[28,0,35,1],[11,0,11,1],[14,0,14,1],[20,0,27,1],[18,0,19,1],[18,2,19,2],[18,4,19,4]]}
[null,{"$f":"補助金交付申請書!B15","v":"令和元年度"}]
[]
["地区小地域福祉ネットワークづくり事業計画書"]
[]
[1,"：","事業目的"]
[]
[]
[]
[]
[2,"：","実施事業"]
[]
["（１）",null,"自治公民館を単位としたネットワーク事業"]
[]
[]
["（２）",null,"地区を単位としたネットワーク事業"]
[]
[3,"：","実施内容"]
[]
[null,null,"事業区分","実施時期","参加対象","総事業費","内　容"]
[null,null,null,"（回数）"]
["自治公民館単位"]
[]
[]
[]
[]
[]
[]
[]
["地区単位"]
[]
[]
[]
[]
[]
[]
[]
["　＊実施内容を簡素にお書きください。"]

{"sheet":"ふれあい給食サービス","index":3,"n_rows":20,"n_cols":11,"rows_kept":20,"cut":false,"hidden":false,"merged":[[23,9,23,10],[17,9,17,10],[18,9,18,10],[19,9,19,10],[20,9,20,10],[21,9,21,10],[22,9,22,10],[16,9,16,10],[14,6,14,8],[15,6,15,8],[16,6,16,8],[17,6,17,8],[11,9,11,10],[12,9,12,10],[13,9,13,10],[14,9,14,10],[15,9,15,10],[7,3,7,7],[20,6,20,8],[21,6,21,8],[22,6,22,8],[23,6,23,8],[18,6,18,8],[19,6,19,8],[9,0,9,1],[10,0,10,1],[11,0,18,1],[19,0,21,1],[0,0,0,9],[4,0,8,1],[3,0,3,1],[4,4,5,4],[4,3,5,3],[8,4,8,6],[3,3,3,5],[3,6,3,10],[11,6,11,8],[12,6,12,8],[13,6,13,8],[6,3,6,7]]}
[{"$f":"補助金交付申請書!B15&\"ふれあい給食サービス事業計画書\"","v":"令和元年度ふれあい給食サービス事業計画書"}]
[]
[]
["社会福祉協議会名",null,null,null,null,null,"地区社会福祉協議会"]
["対　象",null,null,null,"名"]
[]
[null,null,"（内訳）","65歳以上の一人暮らし高齢者",null,null,null,null,null,"名"]
[null,null,null,"重度身体障がい者",null,null,null,null,null,"名"]
[null,null,null,"その他（",null,null,null,"）",null,"名"]
["実施日",null,"毎月第",null,"曜日と第",null,"曜日"]
["協力ボランティア",null,"調理",null,"人、配食",null,"人、調理・配食",null,null,null,"人"]
["その他の事業\n（研修等）"]
[]
[]
[]
[]
[]
[]
[]
["備　考"]

{"sheet":"おたがいさま見守り事業","index":4,"n_rows":27,"n_cols":5,"rows_kept":27,"cut":false,"hidden":false,"merged":[[0,0,0,4],[12,0,12,1],[10,0,10,1],[24,0,24,1],[26,0,26,1]]}
[{"$f":"補助金交付申請書!B15&\"おたがいさま見守り事業（会食・交流）事業計画書\"","v":"令和元年度おたがいさま見守り事業（会食・交流）事業計画書"}]
[]
[null,null,null,null,"地区社会福祉協議会"]
[1,"：","事業目的"]
[]
[]
[]
[]
[2,"：","実施内容"]
[]
["（１）",null,"福祉協力員と対象者等の交流、福祉協力員の研修等"]
[]
["期日",null,"場　所","参加予定者・人数","内　容"]
[]
[]
[]
[]
[]
[]
[]
[]
[]
[]
[]
["（２）",null,"児童・生徒と一人暮らし高齢者等の交流"]
[]
["期日",null,"場　所","参加予定者・人数","内　容"]

{"sheet":"ふれあい・いきいきサロン（新規）","index":5,"n_rows":42,"n_cols":24,"rows_kept":42,"cut":false,"hidden":false,"merged":[[8,7,8,9],[22,0,22,1],[37,0,37,1],[41,0,41,1],[2,0,2,14],[5,10,5,14],[6,10,6,14],[7,10,7,14],[8,10,8,14],[5,7,5,9],[6,7,6,9],[30,0,30,1],[26,0,26,1],[7,7,7,9]]}
["（様式第２号）"]
[]
[{"$f":"補助金交付申請書!B15&\"ふれあい・いきいきサロン事業計画書\"","v":"令和元年度ふれあい・いきいきサロン事業計画書"}]
[]
[]
[null,null,null,null,null,null,null,"サロン名称"]
[null,null,null,null,null,null,null,"代表者名"]
[null,null,null,null,null,null,null,"住所"]
[null,null,null,null,null,null,null,"電話番号"]
[]
[1,"：","事業の目的"]
[]
[]
[]
[]
[]
[2,"：","サロン設立年月日",null,null,"令和",null,"年",null,"月",null,"日",null,null,null,null,null,null,null,null,null,null,null,"　　　"]
[]
[]
[]
[3,"：","事業計画（年間）"]
[]
["（１）",null,"対象者"]
[]
[]
[]
["（２）",null,"実施場所"]
[]
[]
[]
["（３）",null,"活動内容"]
[]
[]
[]
[]
[]
[]
["（４）",null,"会費"]
[]
[]
[]
["（５）",null,"広報"]

{"sheet":"ふれあい・いきいきサロン（継続）","index":6,"n_rows":25,"n_cols":17,"rows_kept":25,"cut":false,"hidden":false,"merged":[[1,3,1,10],[4,15,5,15],[4,1,5,1],[4,2,5,2],[4,3,4,4],[4,5,4,6],[4,7,5,7],[3,15,3,16],[4,8,5,14],[4,16,5,16],[17,8,17,14],[11,8,11,14],[12,8,12,14],[13,8,13,14],[14,8,14,14],[15,8,15,14],[16,8,16,14],[6,8,6,14],[7,8,7,14],[8,8,8,14],[9,8,9,14],[10,8,10,14]]}
["（様式第４号）"]
[null,null,"地区",{"$f":"補助金交付申請書!B15&\"ふれあい・いきいきサロン継続実施状況等確認票\"","v":"令和元年度ふれあい・いきいきサロン継続実施状況等確認票"}]
[]
[null,null,null,null,null,null,null,null,null,"令和",null,"年",null,"月",null,"日 現在"]
["サロン名","自治公民館","補助開始年度","定例会",null,"参加者",null,"会費","活動内容",null,null,null,null,null,null,"補助金\n希   望","休止\n廃止"]
["（世話人）",null,null,"日時","場所","人数","対象者"]
[]
[]
[]
[]
[]
[]
[]
[]
[]
[]
[]
[]
[]
["継続補助金対象サロン"]
["※サロン代表者へ補助金の希望をご確認の上、「補助金希望」の欄に○×でご記入ください。"]
["※代表者他に変更がある場合は、朱書きで訂正をお願いします。"]
["継続補助金対象外または継続補助金を希望しないサロン"]
["※世話人の連絡先とサロンの休止・廃止についてのみご確認ください。"]
["※世話人に変更がある場合は、朱書きで訂正し、休止・廃止となったサロンについては「休止廃止」欄にその旨をご記入ください。"]

{"sheet":"予算書 ①","index":7,"n_rows":16,"n_cols":5,"rows_kept":16,"cut":false,"hidden":false,"merged":[[11,0,15,0],[11,3,11,4],[12,3,12,4],[13,3,13,4],[14,3,14,4],[15,3,15,4],[3,2,3,3],[5,0,5,3],[6,0,10,0],[6,3,6,4],[7,3,7,4],[8,3,8,4],[9,3,9,4],[10,3,10,4]]}
[]
[null,{"$f":"補助金交付申請書!H2&補助金交付申請書!I2&\"年度\"","v":"令和元年度"}]
[]
[null,"　　　　地区","小地域福祉ネットワークづくり事業",null,"収支予算書"]
[]
[null,null,null,null,"（単位：円）"]
["収　　　入","科　　目","予算額","内　　訳"]
[null,{"$f":"C4&\"補助金\"","v":"小地域福祉ネットワークづくり事業補助金"},null,"倉吉市社協"]
[null,"自己財源"]
[]
[null,"合　　計"]
["支　　出","科　　目","予算額","内　　訳"]
[]
[]
[]
[null,"合　　計"]

{"sheet":"予算書②","index":8,"n_rows":26,"n_cols":5,"rows_kept":26,"cut":false,"hidden":false,"merged":[[21,0,25,0],[21,3,21,4],[22,3,22,4],[23,3,23,4],[24,3,24,4],[25,3,25,4],[15,0,15,3],[16,0,20,0],[16,3,16,4],[17,3,17,4],[18,3,18,4],[19,3,19,4],[20,3,20,4],[9,0,13,0],[9,3,9,4],[10,3,10,4],[11,3,11,4],[12,3,12,4],[13,3,13,4],[1,2,1,3],[3,0,3,3],[4,0,8,0],[4,3,4,4],[5,3,5,4],[6,3,6,4],[7,3,7,4],[8,3,8,4]]}
[null,{"$f":"補助金交付申請書!H2&補助金交付申請書!I2&\"年度\"","v":"令和元年度"}]
[null,"　　　　地区","おたがいさま見守り事業（会食・交流事業）補助金",null,"収支予算書"]
[]
["１．福祉協力員と対象者等の交流、福祉協力員の研修等",null,null,null,"（単位：円）"]
["収　　　入","科　　目","予算額","内　　訳"]
[null,{"$f":"C2&\"補助金\"","v":"おたがいさま見守り事業（会食・交流事業）補助金補助金"},null,"倉吉市社協"]
[null,"自己財源"]
[]
[null,"合　　計"]
["支　　出","科　　目","予算額","内　　訳"]
[]
[]
[]
[null,"合　　計"]
[]
["２．児童・生徒と一人暮らし高齢者等の交流",null,null,null,"（単位：円）"]
["収　　　入","科　　目","予算額","内　　訳"]
[null,{"$f":"C14&\"補助金\"","v":"補助金"},null,"倉吉市社協"]
[null,"自己財源"]
[]
[null,"合　　計"]
["支　　出","科　　目","予算額","内　　訳"]
[]
[]
[]
[null,"合　　計"]